{"text_format":"1","workbook":"xlsx","n_sheets":3,"sheets":["Tableau Boîtes N95","Boîtes Masque à cartouches","Boîtes Cartouches"],"not_rendered":{"charts":0,"images":0,"macros":0,"external_links":1,"defined_names":3,"comments":0,"pivot_tables":3},"unopened":[],"bounds":{"document_bytes":16777216,"sheet_cells":100000,"rows_first":2000,"rows_last":500,"rows_between":2000,"halvings":0,"cell_chars":16384,"cell_head_chars":4096},"cells_cut":0,"cells_raw":0,"read":"whole","date_system":"1900"}

{"sheet":"Tableau Boîtes N95","index":0,"n_rows":57,"n_cols":22,"rows_kept":57,"cut":false,"hidden":false,"merged":[[38,9,38,15],[0,0,0,6],[0,9,0,15],[17,9,17,15],[17,0,17,6],[35,0,35,6]]}
["Mont-Laurier - 10",null,null,null,null,null,null,null,null,"Rivière Rouge - 20",null,null,null,null,null,null,null,"Légende"]
["Masques","GRM","Concatener","Moyenne consommation","Nombre de jours restants","Quantité en inventaire en unité","Prévision pour 14 jours",null,null,"Masques","GRM","Concatener","Moyenne consommation","Nombre de jours restants",{"$f":"F2","v":"Quantité en inventaire en unité"},{"$f":"G2","v":"Prévision pour 14 jours"},null,"Rupture"]
["3M1870PLUS",42016822,4201682210,{"$f":"INDEX('[1]FEUILLE DE TRAVAIL'!$A:$AV,MATCH('Tableau Boîtes N95'!C3,'[1]FEUILLE DE TRAVAIL'!$I:$I,0),39)","v":0},{"$f":"IFERROR(F3/D3,F3)","v":1080},{"$f":"INDEX('[1]FEUILLE DE TRAVAIL'!$A:$AV,MATCH('Tableau Boîtes N95'!C3,'[1]FEUILLE DE TRAVAIL'!$I:$I,0),19)","v":1080},null,null,null,"3M1870PLUS",42016822,4201682220,{"$f":"INDEX('[1]FEUILLE DE TRAVAIL'!$A:$AV,MATCH('Tableau Boîtes N95'!L3,'[1]FEUILLE DE TRAVAIL'!$I:$I,0),39)","v":2.8571428571428572},{"$f":"IFERROR(O3/M3,O3)","v":560},{"$f":"INDEX('[1]FEUILLE DE TRAVAIL'!$A:$AV,MATCH('Tableau Boîtes N95'!L3,'[1]FEUILLE DE TRAVAIL'!$I:$I,0),19)","v":1600},null,null,"Vigie"]
["800-1860",42009417,4200941710,{"$f":"INDEX('[1]FEUILLE DE TRAVAIL'!$A:$AV,MATCH('Tableau Boîtes N95'!C4,'[1]FEUILLE DE TRAVAIL'!$I:$I,0),39)","v":0},{"$f":"IFERROR(F4/D4,F4)","v":360},{"$f":"INDEX('[1]FEUILLE DE TRAVAIL'!$A:$AV,MATCH('Tableau Boîtes N95'!C4,'[1]FEUILLE DE TRAVAIL'!$I:$I,0),19)","v":360},null,null,null,"800-1860",42009417,4200941720,{"$f":"INDEX('[1]FEUILLE DE TRAVAIL'!$A:$AV,MATCH('Tableau Boîtes N95'!L4,'[1]FEUILLE DE TRAVAIL'!$I:$I,0),39)","v":0},{"$f":"IFERROR(O4/M4,O4)","v":409},{"$f":"INDEX('[1]FEUILLE DE TRAVAIL'!$A:$AV,MATCH('Tableau Boîtes N95'!L4,'[1]FEUILLE DE TRAVAIL'!$I:$I,0),19)","v":409},null,null,"Quantités suffisantes"]
["A1510",42009438,4200943810,{"$f":"INDEX('[1]FEUILLE DE TRAVAIL'!$A:$AV,MATCH('Tableau Boîtes N95'!C5,'[1]FEUILLE DE TRAVAIL'!$I:$I,0),39)","v":0},1120,{"$f":"INDEX('[1]FEUILLE DE TRAVAIL'!$A:$AV,MATCH('Tableau Boîtes N95'!C5,'[1]FEUILLE DE TRAVAIL'!$I:$I,0),19)","v":1120},null,null,null,"800-1860S",42009418,4200941820,{"$f":"INDEX('[1]FEUILLE DE TRAVAIL'!$A:$AV,MATCH('Tableau Boîtes N95'!L5,'[1]FEUILLE DE TRAVAIL'!$I:$I,0),39)","v":0},577,{"$f":"INDEX('[1]FEUILLE DE TRAVAIL'!$A:$AV,MATCH('Tableau Boîtes N95'!L5,'[1]FEUILLE DE TRAVAIL'!$I:$I,0),19)","v":577},null,null,"Catégorie générale","Masque N95"]
["A1511",42009440,4200944010,{"$f":"INDEX('[1]FEUILLE DE TRAVAIL'!$A:$AV,MATCH('Tableau Boîtes N95'!C6,'[1]FEUILLE DE TRAVAIL'!$I:$I,0),39)","v":0},940,{"$f":"INDEX('[1]FEUILLE DE TRAVAIL'!$A:$AV,MATCH('Tableau Boîtes N95'!C6,'[1]FEUILLE DE TRAVAIL'!$I:$I,0),19)","v":940},null,null,null,"A1510",42009438,4200943820,{"$f":"INDEX('[1]FEUILLE DE TRAVAIL'!$A:$AV,MATCH('Tableau Boîtes N95'!L6,'[1]FEUILLE DE TRAVAIL'!$I:$I,0),39)","v":0},540,{"$f":"INDEX('[1]FEUILLE DE TRAVAIL'!$A:$AV,MATCH('Tableau Boîtes N95'!L6,'[1]FEUILLE DE TRAVAIL'!$I:$I,0),19)","v":540},null,null,"# Magasin",54]
["A1512",42009439,4200943910,{"$f":"INDEX('[1]FEUILLE DE TRAVAIL'!$A:$AV,MATCH('Tableau Boîtes N95'!C7,'[1]FEUILLE DE TRAVAIL'!$I:$I,0),39)","v":0},2488,{"$f":"INDEX('[1]FEUILLE DE TRAVAIL'!$A:$AV,MATCH('Tableau Boîtes N95'!C7,'[1]FEUILLE DE TRAVAIL'!$I:$I,0),19)","v":2488},null,null,null,"A1511",42009440,4200944020,{"$f":"INDEX('[1]FEUILLE DE TRAVAIL'!$A:$AV,MATCH('Tableau Boîtes N95'!L7,'[1]FEUILLE DE TRAVAIL'!$I:$I,0),39)","v":0.35714285714285715},663.6,{"$f":"INDEX('[1]FEUILLE DE TRAVAIL'!$A:$AV,MATCH('Tableau Boîtes N95'!L7,'[1]FEUILLE DE TRAVAIL'!$I:$I,0),19)","v":237},null,null,"RÉSERVE"]
["KC46727",42009446,4200944610,{"$f":"INDEX('[1]FEUILLE DE TRAVAIL'!$A:$AV,MATCH('Tableau Boîtes N95'!C8,'[1]FEUILLE DE TRAVAIL'!$I:$I,0),39)","v":0},0,{"$f":"INDEX('[1]FEUILLE DE TRAVAIL'!$A:$AV,MATCH('Tableau Boîtes N95'!C8,'[1]FEUILLE DE TRAVAIL'!$I:$I,0),19)","v":0},null,null,null,"A1512",42009439,4200943920,{"$f":"INDEX('[1]FEUILLE DE TRAVAIL'!$A:$AV,MATCH('Tableau Boîtes N95'!L8,'[1]FEUILLE DE TRAVAIL'!$I:$I,0),39)","v":1.4285714285714286},229.6,{"$f":"INDEX('[1]FEUILLE DE TRAVAIL'!$A:$AV,MATCH('Tableau Boîtes N95'!L8,'[1]FEUILLE DE TRAVAIL'!$I:$I,0),19)","v":328},null,null,"Étiquettes de lignes","Quantité en Réserve","Moyenne de Consommation moyenne","Nombre de jours restants",{"$f":"G2","v":"Prévision pour 14 jours"}]
["KC46767",42016845,4201684510,{"$f":"INDEX('[1]FEUILLE DE TRAVAIL'!$A:$AV,MATCH('Tableau Boîtes N95'!C9,'[1]FEUILLE DE TRAVAIL'!$I:$I,0),39)","v":0},0,{"$f":"INDEX('[1]FEUILLE DE TRAVAIL'!$A:$AV,MATCH('Tableau Boîtes N95'!C9,'[1]FEUILLE DE TRAVAIL'!$I:$I,0),19)","v":0},null,null,null,"KC46727",42009446,4200944620,{"$f":"INDEX('[1]FEUILLE DE TRAVAIL'!$A:$AV,MATCH('Tableau Boîtes N95'!L9,'[1]FEUILLE DE TRAVAIL'!$I:$I,0),39)","v":0},325,{"$f":"INDEX('[1]FEUILLE DE TRAVAIL'!$A:$AV,MATCH('Tableau Boîtes N95'!L9,'[1]FEUILLE DE TRAVAIL'!$I:$I,0),19)","v":325},null,null,"3M1870PLUS",1411248,41.428571428571431,{"$f":"IFERROR(S9/T9,S9)","v":34064.606896551726}]
["KC46827",42039566,4203956610,{"$f":"INDEX('[1]FEUILLE DE TRAVAIL'!$A:$AV,MATCH('Tableau Boîtes N95'!C10,'[1]FEUILLE DE TRAVAIL'!$I:$I,0),39)","v":0},0,{"$f":"INDEX('[1]FEUILLE DE TRAVAIL'!$A:$AV,MATCH('Tableau Boîtes N95'!C10,'[1]FEUILLE DE TRAVAIL'!$I:$I,0),19)","v":0},null,null,null,"KC46767",42016845,4201684520,{"$f":"INDEX('[1]FEUILLE DE TRAVAIL'!$A:$AV,MATCH('Tableau Boîtes N95'!L10,'[1]FEUILLE DE TRAVAIL'!$I:$I,0),39)","v":1.0714285714285714},126,{"$f":"INDEX('[1]FEUILLE DE TRAVAIL'!$A:$AV,MATCH('Tableau Boîtes N95'!L10,'[1]FEUILLE DE TRAVAIL'!$I:$I,0),19)","v":135},null,null,"3M8210N",9940,0,9940]
["KC46867",42018167,4201816710,{"$f":"INDEX('[1]FEUILLE DE TRAVAIL'!$A:$AV,MATCH('Tableau Boîtes N95'!C11,'[1]FEUILLE DE TRAVAIL'!$I:$I,0),39)","v":0},0,{"$f":"INDEX('[1]FEUILLE DE TRAVAIL'!$A:$AV,MATCH('Tableau Boîtes N95'!C11,'[1]FEUILLE DE TRAVAIL'!$I:$I,0),19)","v":0},null,null,null,"KC46867",42018167,4201816720,{"$f":"INDEX('[1]FEUILLE DE TRAVAIL'!$A:$AV,MATCH('Tableau Boîtes N95'!L11,'[1]FEUILLE DE TRAVAIL'!$I:$I,0),39)","v":0},0,{"$f":"INDEX('[1]FEUILLE DE TRAVAIL'!$A:$AV,MATCH('Tableau Boîtes N95'!L11,'[1]FEUILLE DE TRAVAIL'!$I:$I,0),19)","v":0},null,null,"3M9210",533,0,533]
["KC62126",42009426,4200942610,{"$f":"INDEX('[1]FEUILLE DE TRAVAIL'!$A:$AV,MATCH('Tableau Boîtes N95'!C12,'[1]FEUILLE DE TRAVAIL'!$I:$I,0),39)","v":0},0,{"$f":"INDEX('[1]FEUILLE DE TRAVAIL'!$A:$AV,MATCH('Tableau Boîtes N95'!C12,'[1]FEUILLE DE TRAVAIL'!$I:$I,0),19)","v":0},null,null,null,"KC62126",42009426,4200942620,{"$f":"INDEX('[1]FEUILLE DE TRAVAIL'!$A:$AV,MATCH('Tableau Boîtes N95'!L12,'[1]FEUILLE DE TRAVAIL'!$I:$I,0),39)","v":0},318,{"$f":"INDEX('[1]FEUILLE DE TRAVAIL'!$A:$AV,MATCH('Tableau Boîtes N95'!L12,'[1]FEUILLE DE TRAVAIL'!$I:$I,0),19)","v":318},null,null,"800-1860",11644,0,11644]
["203214 - MEDICOM PETIT",42052187,4205218710,{"$f":"INDEX('[1]FEUILLE DE TRAVAIL'!$A:$AV,MATCH('Tableau Boîtes N95'!C13,'[1]FEUILLE DE TRAVAIL'!$I:$I,0),39)","v":46.428571428571431},{"$f":"IFERROR(F13/D13,F13)","v":93.692307692307693},{"$f":"INDEX('[1]FEUILLE DE TRAVAIL'!$A:$AV,MATCH('Tableau Boîtes N95'!C13,'[1]FEUILLE DE TRAVAIL'!$I:$I,0),19)","v":4350},null,null,null,"203214 - MEDICOM PETIT",42052187,4205218720,{"$f":"INDEX('[1]FEUILLE DE TRAVAIL'!$A:$AV,MATCH('Tableau Boîtes N95'!L13,'[1]FEUILLE DE TRAVAIL'!$I:$I,0),39)","v":10.714285714285714},{"$f":"IFERROR(O13/M13,O13)","v":779.33333333333337},{"$f":"INDEX('[1]FEUILLE DE TRAVAIL'!$A:$AV,MATCH('Tableau Boîtes N95'!L13,'[1]FEUILLE DE TRAVAIL'!$I:$I,0),19)","v":8350},null,null,"800-1860S",4020,0,4020]
["203314 - MEDICOM MOYEN",42052188,4205218810,{"$f":"INDEX('[1]FEUILLE DE TRAVAIL'!$A:$AV,MATCH('Tableau Boîtes N95'!C14,'[1]FEUILLE DE TRAVAIL'!$I:$I,0),39)","v":50},67,{"$f":"INDEX('[1]FEUILLE DE TRAVAIL'!$A:$AV,MATCH('Tableau Boîtes N95'!C14,'[1]FEUILLE DE TRAVAIL'!$I:$I,0),19)","v":3350},null,null,null,"203314 - MEDICOM MOYEN",42052188,4205218820,{"$f":"INDEX('[1]FEUILLE DE TRAVAIL'!$A:$AV,MATCH('Tableau Boîtes N95'!L14,'[1]FEUILLE DE TRAVAIL'!$I:$I,0),39)","v":78.571428571428569},{"$f":"IFERROR(O14/M14,O14)","v":89.090909090909093},{"$f":"INDEX('[1]FEUILLE DE TRAVAIL'!$A:$AV,MATCH('Tableau Boîtes N95'!L14,'[1]FEUILLE DE TRAVAIL'!$I:$I,0),19)","v":7000},null,null,"A1510",13698,0,13698]
["203414 - MEDICOM LARGE",42053531,4205353110,{"$f":"INDEX('[1]FEUILLE DE TRAVAIL'!$A:$AV,MATCH('Tableau Boîtes N95'!C15,'[1]FEUILLE DE TRAVAIL'!$I:$I,0),39)","v":0},{"$f":"IFERROR(F15/D15,F15)","v":0},{"$f":"INDEX('[1]FEUILLE DE TRAVAIL'!$A:$AV,MATCH('Tableau Boîtes N95'!C15,'[1]FEUILLE DE TRAVAIL'!$I:$I,0),19)","v":0},null,null,null,"203414 - MEDICOM LARGE",42053531,4205353120,{"$f":"INDEX('[1]FEUILLE DE TRAVAIL'!$A:$AV,MATCH('Tableau Boîtes N95'!L15,'[1]FEUILLE DE TRAVAIL'!$I:$I,0),39)","v":46.428571428571431},{"$f":"IFERROR(O15/M15,O15)","v":29.076923076923077},{"$f":"INDEX('[1]FEUILLE DE TRAVAIL'!$A:$AV,MATCH('Tableau Boîtes N95'!L15,'[1]FEUILLE DE TRAVAIL'!$I:$I,0),19)","v":1350},null,null,"A1511",8860,0,8860]
["F550 - CHAMPAK",42053795,4205379510,{"$f":"INDEX('[1]FEUILLE DE TRAVAIL'!$A:$AV,MATCH('Tableau Boîtes N95'!C16,'[1]FEUILLE DE TRAVAIL'!$I:$I,0),39)","v":0},{"$f":"IFERROR(F16/D16,F16)","v":1770},{"$f":"INDEX('[1]FEUILLE DE TRAVAIL'!$A:$AV,MATCH('Tableau Boîtes N95'!C16,'[1]FEUILLE DE TRAVAIL'!$I:$I,0),19)","v":1770},null,null,null,"F550 - CHAMPAK",42053795,4205379520,{"$f":"INDEX('[1]FEUILLE DE TRAVAIL'!$A:$AV,MATCH('Tableau Boîtes N95'!L16,'[1]FEUILLE DE TRAVAIL'!$I:$I,0),39)","v":2.1428571428571428},{"$f":"IFERROR(O16/M16,O16)","v":812},{"$f":"INDEX('[1]FEUILLE DE TRAVAIL'!$A:$AV,MATCH('Tableau Boîtes N95'!L16,'[1]FEUILLE DE TRAVAIL'!$I:$I,0),19)","v":1740},null,null,"A1512",6340,0,6340]
[null,null,null,null,null,null,null,null,null,null,null,null,null,null,null,null,null,"A1513",2060,0,2060]
["Sainte-Agathe - 30",null,null,null,null,null,null,null,null,"Saint-Jérôme - 40",null,null,null,null,null,null,null,"A1517",1300,0,1300]
["Masques","GRM","Concatener","Moyenne consommation","Nombre de jours restants",{"$f":"F2","v":"Quantité en inventaire en unité"},{"$f":"G2","v":"Prévision pour 14 jours"},null,null,"Masques","GRM","Concatener","Moyenne consommation","Nombre de jours restants",{"$f":"F2","v":"Quantité en inventaire en unité"},{"$f":"G2","v":"Prévision pour 14 jours"},null,"KC46727",12100,0,12100]
["3M1870PLUS",42016822,4201682230,{"$f":"INDEX('[1]FEUILLE DE TRAVAIL'!$A:$AV,MATCH('Tableau Boîtes N95'!C20,'[1]FEUILLE DE TRAVAIL'!$I:$I,0),39)","v":12.428571428571429},{"$f":"IFERROR(F20/D20,F20)","v":106.68965517241379},{"$f":"INDEX('[1]FEUILLE DE TRAVAIL'!$A:$AV,MATCH('Tableau Boîtes N95'!C20,'[1]FEUILLE DE TRAVAIL'!$I:$I,0),19)","v":1326},null,null,null,"3M1870PLUS",42016822,4201682240,{"$f":"INDEX('[1]FEUILLE DE TRAVAIL'!$A:$AV,MATCH('Tableau Boîtes N95'!L20,'[1]FEUILLE DE TRAVAIL'!$I:$I,0),39)","v":26.071428571428573},{"$f":"IFERROR(O20/M20,O20)","v":72.838356164383555},{"$f":"INDEX('[1]FEUILLE DE TRAVAIL'!$A:$AV,MATCH('Tableau Boîtes N95'!L20,'[1]FEUILLE DE TRAVAIL'!$I:$I,0),19)","v":1899},null,null,"KC46767",70,0,70]
["800-1860",42009417,4200941730,{"$f":"INDEX('[1]FEUILLE DE TRAVAIL'!$A:$AV,MATCH('Tableau Boîtes N95'!C21,'[1]FEUILLE DE TRAVAIL'!$I:$I,0),39)","v":1.4285714285714286},88.2,{"$f":"INDEX('[1]FEUILLE DE TRAVAIL'!$A:$AV,MATCH('Tableau Boîtes N95'!C21,'[1]FEUILLE DE TRAVAIL'!$I:$I,0),19)","v":126},null,null,null,"3M8210N",42031222,4203122240,{"$f":"INDEX('[1]FEUILLE DE TRAVAIL'!$A:$AV,MATCH('Tableau Boîtes N95'!L21,'[1]FEUILLE DE TRAVAIL'!$I:$I,0),39)","v":1.4285714285714286},140,{"$f":"INDEX('[1]FEUILLE DE TRAVAIL'!$A:$AV,MATCH('Tableau Boîtes N95'!L21,'[1]FEUILLE DE TRAVAIL'!$I:$I,0),19)","v":200},null,null,"KC46827",8365,0,8365]
["800-1860S",42009418,4200941830,{"$f":"INDEX('[1]FEUILLE DE TRAVAIL'!$A:$AV,MATCH('Tableau Boîtes N95'!C22,'[1]FEUILLE DE TRAVAIL'!$I:$I,0),39)","v":0},166,{"$f":"INDEX('[1]FEUILLE DE TRAVAIL'!$A:$AV,MATCH('Tableau Boîtes N95'!C22,'[1]FEUILLE DE TRAVAIL'!$I:$I,0),19)","v":166},null,null,null,"800-1860",42009417,4200941740,{"$f":"INDEX('[1]FEUILLE DE TRAVAIL'!$A:$AV,MATCH('Tableau Boîtes N95'!L22,'[1]FEUILLE DE TRAVAIL'!$I:$I,0),39)","v":12.857142857142858},42,{"$f":"INDEX('[1]FEUILLE DE TRAVAIL'!$A:$AV,MATCH('Tableau Boîtes N95'!L22,'[1]FEUILLE DE TRAVAIL'!$I:$I,0),19)","v":540},null,null,"KC46867",0,0,0]
["A1510",42009438,4200943830,{"$f":"INDEX('[1]FEUILLE DE TRAVAIL'!$A:$AV,MATCH('Tableau Boîtes N95'!C23,'[1]FEUILLE DE TRAVAIL'!$I:$I,0),39)","v":1.4285714285714286},182,{"$f":"INDEX('[1]FEUILLE DE TRAVAIL'!$A:$AV,MATCH('Tableau Boîtes N95'!C23,'[1]FEUILLE DE TRAVAIL'!$I:$I,0),19)","v":260},null,null,null,"800-1860S",42009418,4200941840,{"$f":"INDEX('[1]FEUILLE DE TRAVAIL'!$A:$AV,MATCH('Tableau Boîtes N95'!L23,'[1]FEUILLE DE TRAVAIL'!$I:$I,0),39)","v":17.142857142857142},78.166666666666671,{"$f":"INDEX('[1]FEUILLE DE TRAVAIL'!$A:$AV,MATCH('Tableau Boîtes N95'!L23,'[1]FEUILLE DE TRAVAIL'!$I:$I,0),19)","v":1340},null,null,"KC62126",0,0,0]
["A1511",42009440,4200944030,{"$f":"INDEX('[1]FEUILLE DE TRAVAIL'!$A:$AV,MATCH('Tableau Boîtes N95'!C24,'[1]FEUILLE DE TRAVAIL'!$I:$I,0),39)","v":0},359,{"$f":"INDEX('[1]FEUILLE DE TRAVAIL'!$A:$AV,MATCH('Tableau Boîtes N95'!C24,'[1]FEUILLE DE TRAVAIL'!$I:$I,0),19)","v":359},null,null,null,"A1510",42009438,4200943840,{"$f":"INDEX('[1]FEUILLE DE TRAVAIL'!$A:$AV,MATCH('Tableau Boîtes N95'!L24,'[1]FEUILLE DE TRAVAIL'!$I:$I,0),39)","v":8.5714285714285712},37.333333333333336,{"$f":"INDEX('[1]FEUILLE DE TRAVAIL'!$A:$AV,MATCH('Tableau Boîtes N95'!L24,'[1]FEUILLE DE TRAVAIL'!$I:$I,0),19)","v":320},null,null,"MMMM8110S",0,0,0]
["A1512",42009439,4200943930,{"$f":"INDEX('[1]FEUILLE DE TRAVAIL'!$A:$AV,MATCH('Tableau Boîtes N95'!C25,'[1]FEUILLE DE TRAVAIL'!$I:$I,0),39)","v":2.8571428571428572},56,{"$f":"INDEX('[1]FEUILLE DE TRAVAIL'!$A:$AV,MATCH('Tableau Boîtes N95'!C25,'[1]FEUILLE DE TRAVAIL'!$I:$I,0),19)","v":160},null,null,null,"A1511",42009440,4200944040,{"$f":"INDEX('[1]FEUILLE DE TRAVAIL'!$A:$AV,MATCH('Tableau Boîtes N95'!L25,'[1]FEUILLE DE TRAVAIL'!$I:$I,0),39)","v":8.5714285714285712},32.666666666666664,{"$f":"INDEX('[1]FEUILLE DE TRAVAIL'!$A:$AV,MATCH('Tableau Boîtes N95'!L25,'[1]FEUILLE DE TRAVAIL'!$I:$I,0),19)","v":280},null,null,203314,622250,482.14285714285717,{"$f":"IFERROR(S25/T25,S25)","v":1290.5925925925926}]
["A1513",42034311,4203431130,{"$f":"INDEX('[1]FEUILLE DE TRAVAIL'!$A:$AV,MATCH('Tableau Boîtes N95'!C26,'[1]FEUILLE DE TRAVAIL'!$I:$I,0),39)","v":0},69,{"$f":"INDEX('[1]FEUILLE DE TRAVAIL'!$A:$AV,MATCH('Tableau Boîtes N95'!C26,'[1]FEUILLE DE TRAVAIL'!$I:$I,0),19)","v":69},null,null,null,"A1512",42009439,4200943940,{"$f":"INDEX('[1]FEUILLE DE TRAVAIL'!$A:$AV,MATCH('Tableau Boîtes N95'!L26,'[1]FEUILLE DE TRAVAIL'!$I:$I,0),39)","v":8.5714285714285712},44.333333333333336,{"$f":"INDEX('[1]FEUILLE DE TRAVAIL'!$A:$AV,MATCH('Tableau Boîtes N95'!L26,'[1]FEUILLE DE TRAVAIL'!$I:$I,0),19)","v":380},null,null,203214,242750,235.71428571428572,1029.8484848484848]
["KC46727",42009446,4200944630,{"$f":"INDEX('[1]FEUILLE DE TRAVAIL'!$A:$AV,MATCH('Tableau Boîtes N95'!C27,'[1]FEUILLE DE TRAVAIL'!$I:$I,0),39)","v":0},0,{"$f":"INDEX('[1]FEUILLE DE TRAVAIL'!$A:$AV,MATCH('Tableau Boîtes N95'!C27,'[1]FEUILLE DE TRAVAIL'!$I:$I,0),19)","v":0},null,null,null,"A1513",42034311,4203431140,{"$f":"INDEX('[1]FEUILLE DE TRAVAIL'!$A:$AV,MATCH('Tableau Boîtes N95'!L27,'[1]FEUILLE DE TRAVAIL'!$I:$I,0),39)","v":0},{"$f":"IFERROR(O27/M27,O27)","v":840},{"$f":"INDEX('[1]FEUILLE DE TRAVAIL'!$A:$AV,MATCH('Tableau Boîtes N95'!L27,'[1]FEUILLE DE TRAVAIL'!$I:$I,0),19)","v":840},null,null,203414,358750,185.71428571428572,1931.7307692307691]
["KC46767",42016845,4201684530,{"$f":"INDEX('[1]FEUILLE DE TRAVAIL'!$A:$AV,MATCH('Tableau Boîtes N95'!C28,'[1]FEUILLE DE TRAVAIL'!$I:$I,0),39)","v":0},105,{"$f":"INDEX('[1]FEUILLE DE TRAVAIL'!$A:$AV,MATCH('Tableau Boîtes N95'!C28,'[1]FEUILLE DE TRAVAIL'!$I:$I,0),19)","v":105},null,null,null,"KC46727",42009446,4200944640,{"$f":"INDEX('[1]FEUILLE DE TRAVAIL'!$A:$AV,MATCH('Tableau Boîtes N95'!L28,'[1]FEUILLE DE TRAVAIL'!$I:$I,0),39)","v":17.5},{"$f":"IFERROR(O28/M28,O28)","v":15.942857142857143},{"$f":"INDEX('[1]FEUILLE DE TRAVAIL'!$A:$AV,MATCH('Tableau Boîtes N95'!L28,'[1]FEUILLE DE TRAVAIL'!$I:$I,0),19)","v":279}]
["KC62126",42009426,4200942630,{"$f":"INDEX('[1]FEUILLE DE TRAVAIL'!$A:$AV,MATCH('Tableau Boîtes N95'!C29,'[1]FEUILLE DE TRAVAIL'!$I:$I,0),39)","v":0},50,{"$f":"INDEX('[1]FEUILLE DE TRAVAIL'!$A:$AV,MATCH('Tableau Boîtes N95'!C29,'[1]FEUILLE DE TRAVAIL'!$I:$I,0),19)","v":50},null,null,null,"KC46767",42016845,4201684540,{"$f":"INDEX('[1]FEUILLE DE TRAVAIL'!$A:$AV,MATCH('Tableau Boîtes N95'!L29,'[1]FEUILLE DE TRAVAIL'!$I:$I,0),39)","v":0},0,{"$f":"INDEX('[1]FEUILLE DE TRAVAIL'!$A:$AV,MATCH('Tableau Boîtes N95'!L29,'[1]FEUILLE DE TRAVAIL'!$I:$I,0),19)","v":0}]
["MMMM8110S",42050242,4205024230,{"$f":"INDEX('[1]FEUILLE DE TRAVAIL'!$A:$AV,MATCH('Tableau Boîtes N95'!C30,'[1]FEUILLE DE TRAVAIL'!$I:$I,0),39)","v":0},0,{"$f":"INDEX('[1]FEUILLE DE TRAVAIL'!$A:$AV,MATCH('Tableau Boîtes N95'!C30,'[1]FEUILLE DE TRAVAIL'!$I:$I,0),19)","v":0},null,null,null,"KC46827",42039566,4203956640,{"$f":"INDEX('[1]FEUILLE DE TRAVAIL'!$A:$AV,MATCH('Tableau Boîtes N95'!L30,'[1]FEUILLE DE TRAVAIL'!$I:$I,0),39)","v":7.5},93.333333333333329,{"$f":"INDEX('[1]FEUILLE DE TRAVAIL'!$A:$AV,MATCH('Tableau Boîtes N95'!L30,'[1]FEUILLE DE TRAVAIL'!$I:$I,0),19)","v":700}]
["203214 - MEDICOM PETIT",42052187,4205218730,{"$f":"INDEX('[1]FEUILLE DE TRAVAIL'!$A:$AV,MATCH('Tableau Boîtes N95'!C31,'[1]FEUILLE DE TRAVAIL'!$I:$I,0),39)","v":78.571428571428569},38.18181818181818,{"$f":"INDEX('[1]FEUILLE DE TRAVAIL'!$A:$AV,MATCH('Tableau Boîtes N95'!C31,'[1]FEUILLE DE TRAVAIL'!$I:$I,0),19)","v":3000},null,null,null,"KC46867",42018167,4201816740,{"$f":"INDEX('[1]FEUILLE DE TRAVAIL'!$A:$AV,MATCH('Tableau Boîtes N95'!L31,'[1]FEUILLE DE TRAVAIL'!$I:$I,0),39)","v":0},0,{"$f":"INDEX('[1]FEUILLE DE TRAVAIL'!$A:$AV,MATCH('Tableau Boîtes N95'!L31,'[1]FEUILLE DE TRAVAIL'!$I:$I,0),19)","v":0}]
["203314 - MEDICOM MOYEN",42052188,4205218830,{"$f":"INDEX('[1]FEUILLE DE TRAVAIL'!$A:$AV,MATCH('Tableau Boîtes N95'!C32,'[1]FEUILLE DE TRAVAIL'!$I:$I,0),39)","v":128.57142857142858},22.524444444444441,{"$f":"INDEX('[1]FEUILLE DE TRAVAIL'!$A:$AV,MATCH('Tableau Boîtes N95'!C32,'[1]FEUILLE DE TRAVAIL'!$I:$I,0),19)","v":2896},null,null,null,"KC62126",42009426,4200942640,{"$f":"INDEX('[1]FEUILLE DE TRAVAIL'!$A:$AV,MATCH('Tableau Boîtes N95'!L32,'[1]FEUILLE DE TRAVAIL'!$I:$I,0),39)","v":8.5714285714285712},32.083333333333336,{"$f":"INDEX('[1]FEUILLE DE TRAVAIL'!$A:$AV,MATCH('Tableau Boîtes N95'!L32,'[1]FEUILLE DE TRAVAIL'!$I:$I,0),19)","v":275}]
["203414 - MEDICOM LARGE",42053531,4205353130,{"$f":"INDEX('[1]FEUILLE DE TRAVAIL'!$A:$AV,MATCH('Tableau Boîtes N95'!C33,'[1]FEUILLE DE TRAVAIL'!$I:$I,0),39)","v":3.5714285714285716},182,{"$f":"INDEX('[1]FEUILLE DE TRAVAIL'!$A:$AV,MATCH('Tableau Boîtes N95'!C33,'[1]FEUILLE DE TRAVAIL'!$I:$I,0),19)","v":650},null,null,null,"MMMM8110S",42050242,4205024240,{"$f":"INDEX('[1]FEUILLE DE TRAVAIL'!$A:$AV,MATCH('Tableau Boîtes N95'!L33,'[1]FEUILLE DE TRAVAIL'!$I:$I,0),39)","v":0},0,{"$f":"INDEX('[1]FEUILLE DE TRAVAIL'!$A:$AV,MATCH('Tableau Boîtes N95'!L33,'[1]FEUILLE DE TRAVAIL'!$I:$I,0),19)","v":0}]
["F550 - CHAMPAK",42053795,4205379530,{"$f":"INDEX('[1]FEUILLE DE TRAVAIL'!$A:$AV,MATCH('Tableau Boîtes N95'!C34,'[1]FEUILLE DE TRAVAIL'!$I:$I,0),39)","v":6.4285714285714288},200.66666666666666,{"$f":"INDEX('[1]FEUILLE DE TRAVAIL'!$A:$AV,MATCH('Tableau Boîtes N95'!C34,'[1]FEUILLE DE TRAVAIL'!$I:$I,0),19)","v":1290},null,null,null,"203214 - MEDICOM PETIT",42052187,4205218740,{"$f":"INDEX('[1]FEUILLE DE TRAVAIL'!$A:$AV,MATCH('Tableau Boîtes N95'!L34,'[1]FEUILLE DE TRAVAIL'!$I:$I,0),39)","v":153.57142857142858},{"$f":"IFERROR(O34/M34,O34)","v":35.813953488372093},{"$f":"INDEX('[1]FEUILLE DE TRAVAIL'!$A:$AV,MATCH('Tableau Boîtes N95'!L34,'[1]FEUILLE DE TRAVAIL'!$I:$I,0),19)","v":5500}]
[null,null,null,null,null,null,null,null,null,"203314 - MEDICOM MOYEN",42052188,4205218840,{"$f":"INDEX('[1]FEUILLE DE TRAVAIL'!$A:$AV,MATCH('Tableau Boîtes N95'!L35,'[1]FEUILLE DE TRAVAIL'!$I:$I,0),39)","v":210.71428571428572},18.271186440677965,{"$f":"INDEX('[1]FEUILLE DE TRAVAIL'!$A:$AV,MATCH('Tableau Boîtes N95'!L35,'[1]FEUILLE DE TRAVAIL'!$I:$I,0),19)","v":3850}]
["Saint-Eustache - 60",null,null,null,null,null,null,null,null,"203414 - MEDICOM LARGE",42053531,4205353140,{"$f":"INDEX('[1]FEUILLE DE TRAVAIL'!$A:$AV,MATCH('Tableau Boîtes N95'!L36,'[1]FEUILLE DE TRAVAIL'!$I:$I,0),39)","v":17.857142857142858},{"$f":"IFERROR(O36/M36,O36)","v":50.4},{"$f":"INDEX('[1]FEUILLE DE TRAVAIL'!$A:$AV,MATCH('Tableau Boîtes N95'!L36,'[1]FEUILLE DE TRAVAIL'!$I:$I,0),19)","v":900}]
["Masques","GRM","Concatener","Moyenne consommation","Nombre de jours restants",{"$f":"F2","v":"Quantité en inventaire en unité"},{"$f":"G2","v":"Prévision pour 14 jours"},null,null,"F550 - CHAMPAK",42053795,4205379540,{"$f":"INDEX('[1]FEUILLE DE TRAVAIL'!$A:$AV,MATCH('Tableau Boîtes N95'!L37,'[1]FEUILLE DE TRAVAIL'!$I:$I,0),39)","v":40},{"$f":"IFERROR(O37/M37,O37)","v":55.7},{"$f":"INDEX('[1]FEUILLE DE TRAVAIL'!$A:$AV,MATCH('Tableau Boîtes N95'!L37,'[1]FEUILLE DE TRAVAIL'!$I:$I,0),19)","v":2228}]
["3M1870PLUS",42016822,4201682260,{"$f":"INDEX('[1]FEUILLE DE TRAVAIL'!$A:$AV,MATCH('Tableau Boîtes N95'!C38,'[1]FEUILLE DE TRAVAIL'!$I:$I,0),39)","v":52.857142857142854},{"$f":"IFERROR(F38/D38,F38)","v":6.2432432432432439},{"$f":"INDEX('[1]FEUILLE DE TRAVAIL'!$A:$AV,MATCH('Tableau Boîtes N95'!C38,'[1]FEUILLE DE TRAVAIL'!$I:$I,0),19)","v":330}]
["3M8210N",42031222,4203122260,{"$f":"INDEX('[1]FEUILLE DE TRAVAIL'!$A:$AV,MATCH('Tableau Boîtes N95'!C39,'[1]FEUILLE DE TRAVAIL'!$I:$I,0),39)","v":0},660,{"$f":"INDEX('[1]FEUILLE DE TRAVAIL'!$A:$AV,MATCH('Tableau Boîtes N95'!C39,'[1]FEUILLE DE TRAVAIL'!$I:$I,0),19)","v":660},null,null,null,"Lachute - 80"]
["800-1860",42009417,4200941760,{"$f":"INDEX('[1]FEUILLE DE TRAVAIL'!$A:$AV,MATCH('Tableau Boîtes N95'!C40,'[1]FEUILLE DE TRAVAIL'!$I:$I,0),39)","v":10},38,{"$f":"INDEX('[1]FEUILLE DE TRAVAIL'!$A:$AV,MATCH('Tableau Boîtes N95'!C40,'[1]FEUILLE DE TRAVAIL'!$I:$I,0),19)","v":380},null,null,null,"Masques","GRM","Concatener","Moyenne consommation","Nombre de jours restants",{"$f":"F2","v":"Quantité en inventaire en unité"},{"$f":"G2","v":"Prévision pour 14 jours"}]
{"$rows_left_out":18}
{"sheet":"Boîtes Masque à cartouches","index":1,"n_rows":11,"n_cols":11,"rows_kept":11,"cut":false,"hidden":false,"merged":[[0,0,0,10],[6,0,6,1]]}
["Masque à cartouches"]
["DESCRIPTION COURTE","Demi Masque Grandeur","Somme de STOCK",null,null,null,null,null,null,null,"CISSS"]
["Demi-masque réutilisable","Large",1433,null,null,null,null,null,null,null,{"$f":"IF(C3>=1000,\"3 Boîtes\",IF(AND(C3<1000,C3>=500),\"2 Boîtes\",IF(AND(C3<500,C3>=50),\"1 Boîte\",\"0 Boîte\")))","v":"3 Boîtes"}]
[null,"Moyen",3816,null,null,null,null,null,null,null,{"$f":"IF(C4>=1000,\"3 Boîtes\",IF(AND(C4<1000,C4>=500),\"2 Boîtes\",IF(AND(C4<500,C4>=50),\"1 Boîte\",\"0 Boîte\")))","v":"3 Boîtes"}]
[null,"Small",3024,null,null,null,null,null,null,null,{"$f":"IF(C5>=1000,\"3 Boîtes\",IF(AND(C5<1000,C5>=500),\"2 Boîtes\",IF(AND(C5<500,C5>=50),\"1 Boîte\",\"0 Boîte\")))","v":"3 Boîtes"}]
[]
["Légende"]
["0 Boîte"]
["1 Boîte"]
["2 Boîtes"]
["3 Boîtes"]

{"sheet":"Boîtes Cartouches","index":2,"n_rows":14,"n_cols":4,"rows_kept":14,"cut":false,"hidden":false,"merged":[[0,0,0,3],[9,0,9,1]]}
["Cartouches"]
["DESCRIPTION COURTE","Code d'article","Somme de STOCK","CISSS"]
["Cartouches","3M2091",3871,{"$f":"IF(C3>=1000,\"3 Boîtes\",IF(AND(C3<1000,C3>=500),\"2 Boîtes\",IF(AND(C3<500,C3>=50),\"1 Boîte\",\"0 Boîte\")))","v":"3 Boîtes"}]
[null,"3M60923",3469,{"$f":"IF(C4>=1000,\"3 Boîtes\",IF(AND(C4<1000,C4>=500),\"2 Boîtes\",IF(AND(C4<500,C4>=50),\"1 Boîte\",\"0 Boîte\")))","v":"3 Boîtes"}]
[null,"3M7093",560,"2 Boîtes"]
[null,"MMM60926",3120,"3 Boîtes"]
[null,"SM913",1207,"3 Boîtes"]
[]
[]
["Légende"]
["0 Boîte"]
["1 Boîte"]
["2 Boîtes"]
["3 Boîtes"]