{"text_format":"1","workbook":"xlsx","n_sheets":3,"sheets":["UA","Fiche","Indicateur"],"not_rendered":{"charts":0,"images":1,"macros":1,"external_links":3,"defined_names":1,"comments":1,"pivot_tables":0},"unopened":[],"bounds":{"document_bytes":16777216,"sheet_cells":100000,"rows_first":2000,"rows_last":500,"rows_between":2000,"halvings":0,"cell_chars":16384,"cell_head_chars":4096},"cells_cut":0,"cells_raw":0,"read":"whole","date_system":"1900"}

{"sheet":"UA","index":0,"n_rows":2341,"n_cols":8,"rows_kept":2341,"cut":false,"hidden":true,"merged":[]}
["code primaire","UA","Code adresse","site","adresse","Ville","Code postale","Nom"]
[100171,8999501,1070,700,"100, RUE DU CHANOINE-LIONEL-GROULX","SAINTE-THERESE","J7E 5E1","TB CNR CHSLD Boisé Ste-Thérèse"]
[100171,8999400,1060,400,"290 RUE MONTIGNY","SAINT-JEROME","J7Z 5T3","SJ CNR intérêts sur emprunts"]
[100171,7158010,1060,400,"290 RUE MONTIGNY","SAINT-JEROME","J7Z 5T3","CI Services ambulanciers"]
[100171,7158018,1060,400,"290 RUE MONTIGNY","SAINT-JEROME","J7Z 5T3","CI SPU Premiers répondants form. préparation"]
[100171,7158016,1060,400,"290 RUE MONTIGNY","SAINT-JEROME","J7Z 5T3","CI SPU Formation continue régionale"]
[100171,8999700,1051,800,"145 AVENUE DE LA PROVIDENCE","LACHUTE","J8H 4C7","AR Comité des usagers"]
[100171,8999702,1051,800,"145 AVENUE DE LA PROVIDENCE","LACHUTE","J8H 4C7","AR Congé après accumulation"]
[100171,8999127,8000,100,"2561 CHEMIN DE LA LIEVRE SUD","MONT-LAURIER","J9L 3G3","AL EV ML-Liste rappel-Soins infirm."]
[100171,8999125,1047,200,"1525 RUE L'ANNONCIATION NORD","RIVIERE-ROUGE","J0T 1T0","AL EV RR-Liste rappel-Soins infirm."]
[100171,8999124,1047,200,"1525 RUE L'ANNONCIATION NORD","RIVIERE-ROUGE","J0T 1T0","AL EV RR/Gériatrie/Psychiatrie"]
[100171,8999123,1047,200,"1525 RUE L'ANNONCIATION NORD","RIVIERE-ROUGE","J0T 1T0","AL EV RR/Soins infirmiers"]
[100171,8999121,8000,100,"2561 CHEMIN DE LA LIEVRE SUD","MONT-LAURIER","J9L 3G3","AL INACTIF Dépenses remboursées"]
[100171,8999112,1047,200,"1525 RUE L'ANNONCIATION NORD","RIVIERE-ROUGE","J0T 1T0","AL EV Réclamations-Remplacements"]
[100171,7303110,1047,200,"1525 RUE L'ANNONCIATION NORD","RIVIERE-ROUGE","J0T 1T0","AL Comité paritaire SST"]
[100171,8999007,1044,100,"757 DE LA MADONE","MONT-LAURIER","J9L 1T3","CI CNR - Prov Ass salaire"]
[100171,8999100,1047,200,"1525 RUE L'ANNONCIATION NORD","RIVIERE-ROUGE","J0T 1T0","AL Comité des usagers"]
[100171,8999672,1093,600,"520 BOUL. ARTHUR-SAUVE","SAINT-EUSTACHE","J7R 5B1","DM EV Occasionnel HSE"]
[100171,7303601,1093,600,"520 BOUL. ARTHUR-SAUVE","SAINT-EUSTACHE","J7R 5B1","DM EV Équipe volante"]
[100171,8052941,1085,300,"234 RUE SAINT-VINCENT","SAINTE-AGATHE-DES-MONTS","J8C 2B8","FL ICI-TED-N6 - SA"]
[100171,8051949,1047,200,"1525 RUE L'ANNONCIATION NORD","RIVIERE-ROUGE","J0T 1T0","FL AR-RIVIÈRE ROUGE"]
[100171,8051941,1085,300,"234 RUE SAINT-VINCENT","SAINTE-AGATHE-DES-MONTS","J8C 2B8","FL AR-SERV STE-AGATHE/PEH"]
[100171,8051932,1070,700,"100, RUE DU CHANOINE-LIONEL-GROULX","SAINTE-THERESE","J7E 5E1","FL AR-DI TSA 22+ TDB"]
[100171,8051930,1060,400,"290 RUE MONTIGNY","SAINT-JEROME","J7Z 5T3","FL AR-COOR-DI-TSA 22+"]
[100171,8051925,1085,700,"234 RUE SAINT-VINCENT","SAINTE-AGATHE-DES-MONTS","J8C 2B8","FL AR-DI N6"]
[100171,8051921,1060,400,"290 RUE MONTIGNY","SAINT-JEROME","J7Z 5T3","FL AR-DI TSA 7-21 CTRE"]
[100171,8051900,1147,900,"125 A RUE TOUR DU LAC","STE-AGATHE-DES-MONTS","J8C 3A1","FL Rég./AEO/DITSA  Accès"]
[100171,7995101,1047,200,"1525 RUE L'ANNONCIATION NORD","RIVIERE-ROUGE","J0T 1T0","AL Virus EBOLA"]
[100171,7910700,1051,800,"145 AVENUE DE LA PROVIDENCE","LACHUTE","J8H 4C7","AR Besoins spéciaux"]
[100171,7910642,1070,700,"100, RUE DU CHANOINE-LIONEL-GROULX","SAINTE-THERESE","J7E 5E1","DM Besoins spéciaux"]
[100171,7910500,1070,700,"100, RUE DU CHANOINE-LIONEL-GROULX","SAINTE-THERESE","J7E 5E1","TB Besoins spéciaux"]
[100171,7910403,1060,400,"290 RUE MONTIGNY","SAINT-JEROME","J7Z 5T3","SJ Besoins spéc Auberge"]
[100171,7910402,1060,400,"290 RUE MONTIGNY","SAINT-JEROME","J7Z 5T3","SJ Besoins spéc Résidence"]
[100171,7910401,1060,400,"290 RUE MONTIGNY","SAINT-JEROME","J7Z 5T3","SJ Besoins spéc Youville"]
[100171,7910203,1085,300,"234 RUE SAINT-VINCENT","SAINTE-AGATHE-DES-MONTS","J8C 2B8","DS Besoins spéciaux - Labelle"]
[100171,7910202,1085,300,"234 RUE SAINT-VINCENT","SAINTE-AGATHE-DES-MONTS","J8C 2B8","DS Besoins spéciaux - St-Jovite"]
[100171,7910201,1085,300,"234 RUE SAINT-VINCENT","SAINTE-AGATHE-DES-MONTS","J8C 2B8","DS Beoins spéciaux - P.Lapointe"]
[100171,7910103,8000,100,"2561 CHEMIN DE LA LIEVRE SUD","MONT-LAURIER","J9L 3G3","AL SA-Besoins spéciaux"]
[100171,7910102,1047,200,"1525 RUE L'ANNONCIATION NORD","RIVIERE-ROUGE","J0T 1T0","AL RR-Dép.remboursées par clients en fiducie"]
[100171,7910101,1047,200,"1525 RUE L'ANNONCIATION NORD","RIVIERE-ROUGE","J0T 1T0","AL RR-Besoins spéciaux"]
[100171,7906700,1051,800,"145 AVENUE DE LA PROVIDENCE","LACHUTE","J8H 4C7","AR Indemnité en fin d'emploi"]
[100171,7906672,1093,600,"520 BOUL. ARTHUR-SAUVE","SAINT-EUSTACHE","J7R 5B1","DM Indemnité de cessation d'emploi"]
[100171,7906500,1070,700,"100, RUE DU CHANOINE-LIONEL-GROULX","SAINTE-THERESE","J7E 5E1","TB Indemnités de cess. d'emploi"]
[100171,7906400,1060,400,"290 RUE MONTIGNY","SAINT-JEROME","J7Z 5T3","SJ Indemnités cessation d'emploi"]
[100171,7906200,1085,300,"234 RUE SAINT-VINCENT","SAINTE-AGATHE-DES-MONTS","J8C 2B8","DS Indemnités cessation emploi"]
[100171,7906101,1047,200,"1525 RUE L'ANNONCIATION NORD","RIVIERE-ROUGE","J0T 1T0","AL Indemnités cessation emploi"]
[100171,7905700,1051,800,"145 AVENUE DE LA PROVIDENCE","LACHUTE","J8H 4C7","AR Personnel non disp. en assignation"]
[100171,7905672,1093,600,"520 BOUL. ARTHUR-SAUVE","SAINT-EUSTACHE","J7R 5B1","DM Pers. non disponible à une affectation"]
[100171,7904700,1051,800,"145 AVENUE DE LA PROVIDENCE","LACHUTE","J8H 4C7","AR Personnel en attente d'assignation"]
[100171,7904672,1093,600,"520 BOUL. ARTHUR-SAUVE","SAINT-EUSTACHE","J7R 5B1","DM Pers. en attente d'assignation"]
[100171,7904500,1070,700,"100, RUE DU CHANOINE-LIONEL-GROULX","SAINTE-THERESE","J7E 5E1","TB Pers. attente d'assigantion"]
[100171,7904400,1060,400,"290 RUE MONTIGNY","SAINT-JEROME","J7Z 5T3","SJ Personnel en attente d'assignation"]
[100171,7903672,1093,600,"520 BOUL. ARTHUR-SAUVE","SAINT-EUSTACHE","J7R 5B1","DM Personnel en recyclage"]
[100171,7902672,1093,600,"520 BOUL. ARTHUR-SAUVE","SAINT-EUSTACHE","J7R 5B1","DM Personne en orientation, adaptation"]
[100171,7901700,1051,800,"145 AVENUE DE LA PROVIDENCE","LACHUTE","J8H 4C7","AR Personnel surnuméraire"]
[100171,7901672,1093,600,"520 BOUL. ARTHUR-SAUVE","SAINT-EUSTACHE","J7R 5B1","DM Personnel en surnuméraire"]
[100171,7807803,1029,901,"225 CHEMIN DU LAC-BERTRAND","SAINTE-SOPHIE","J5J 2M1","CJ Entr. & rép.inst.-Ste-Sophie"]
[100171,7807802,1035,901,"333 RUE ANTONIN-CAMPEAU","DEUX-MONTAGNES","J7R 3W7","CJ E.&rép.inst.-Deux-Mont refact."]
[100171,7807000,1060,null,"290 RUE MONTIGNY","SAINT-JEROME","J7Z 5T3","CR Entretien et rép. - Immobilier, mobilier, équip."]
[100171,7806432,1060,400,"290 RUE MONTIGNY","SAINT-JEROME","J7Z 5T3","SJ Projet 2013-026-IVG"]
[100171,7806431,1060,400,"290 RUE MONTIGNY","SAINT-JEROME","J7Z 5T3","SJ Projet 2013-016"]
[100171,7806430,1060,400,"290 RUE MONTIGNY","SAINT-JEROME","J7Z 5T3","SJ Projet 2013-026-CEP-B"]
[100171,7806429,1060,400,"290 RUE MONTIGNY","SAINT-JEROME","J7Z 5T3","SJ Projet 2011-067"]
[100171,7806428,1060,400,"290 RUE MONTIGNY","SAINT-JEROME","J7Z 5T3","SJ Projet 2013-026-SINTER"]
[100171,7806427,1060,400,"290 RUE MONTIGNY","SAINT-JEROME","J7Z 5T3","SJ Réaménagement des locaux au 55 rue St-Joseph 276 000$"]
[100171,7806426,1060,400,"290 RUE MONTIGNY","SAINT-JEROME","J7Z 5T3","SJ Installation d'un 2e scan en radiologie (1.5M $ Fondation Hô"]
[100171,7806425,1060,400,"290 RUE MONTIGNY","SAINT-JEROME","J7Z 5T3","SJ Analyse/étude sismique MA13-14 25 000 $"]
[100171,7806424,1060,400,"290 RUE MONTIGNY","SAINT-JEROME","J7Z 5T3","SJ Chaîne robotisée au laboratoire"]
[100171,7806423,1060,400,"290 RUE MONTIGNY","SAINT-JEROME","J7Z 5T3","SJ Ajout de chambre en gériatrie 7e étage 70 000$ 2015-16"]
[100171,7806422,1060,400,"290 RUE MONTIGNY","SAINT-JEROME","J7Z 5T3","SJ Rénovation fonctionnelle mineure en CHSLD 46 000 $"]
[100171,7806421,1060,400,"290 RUE MONTIGNY","SAINT-JEROME","J7Z 5T3","SJ Rénovation fonctionnelle mineure en CHSLD 294 592 $ ART"]
[100171,7806420,1060,400,"290 RUE MONTIGNY","SAINT-JEROME","J7Z 5T3","SJ Projet centre mère-enfant (1 500 000$ fondation Hôp.)"]
[100171,7806419,1060,400,"290 RUE MONTIGNY","SAINT-JEROME","J7Z 5T3","SJ DAI - Pavillon de santé mentale 600 000 $"]
[100171,7806418,1060,400,"290 RUE MONTIGNY","SAINT-JEROME","J7Z 5T3","SJ Réaménagement salles de bain à l'Auberge 240 000$"]
[100171,7806417,1060,400,"290 RUE MONTIGNY","SAINT-JEROME","J7Z 5T3","SJ Poste de garde et système de pagette Auberge 89000$"]
[100171,7806416,1060,400,"290 RUE MONTIGNY","SAINT-JEROME","J7Z 5T3","SJ Agrandissement cafétéria en lien avec 212 lits 250 000$"]
[100171,7806415,1060,400,"290 RUE MONTIGNY","SAINT-JEROME","J7Z 5T3","SJ Réfection du réseau de plomberie (colonnes de drainage)"]
[100171,7806414,1060,400,"290 RUE MONTIGNY","SAINT-JEROME","J7Z 5T3","SJ Programme de mise à niveau des revêtements de sol"]
[100171,7806413,1060,400,"290 RUE MONTIGNY","SAINT-JEROME","J7Z 5T3","SJ Installation d'équipements pour le PCEM (PRF 10-11)"]
[100171,7806412,1060,400,"290 RUE MONTIGNY","SAINT-JEROME","J7Z 5T3","SJ Programme de réfection de l'enveloppe intérieure"]
[100171,7806411,1060,400,"290 RUE MONTIGNY","SAINT-JEROME","J7Z 5T3","SJ Réfection des toitures 2009-10 (125 000$)"]
[100171,7806410,1060,400,"290 RUE MONTIGNY","SAINT-JEROME","J7Z 5T3","SJ Programme de réfection des gaz médicaux (MA 50 000 $)"]
[100171,7806409,1060,400,"290 RUE MONTIGNY","SAINT-JEROME","J7Z 5T3","SJ Programme de mise aux normes du réseau de détection"]
[100171,7806408,1060,400,"290 RUE MONTIGNY","SAINT-JEROME","J7Z 5T3","SJ Mise à niveau des systèmes d'appel de garde - Phase 1"]
[100171,7806407,1060,400,"290 RUE MONTIGNY","SAINT-JEROME","J7Z 5T3","SJ Prog. mise niveau réseau électrique d'urgence (génératrice)"]
[100171,7806406,1060,400,"290 RUE MONTIGNY","SAINT-JEROME","J7Z 5T3","SJ Tour C"]
[100171,7806405,1060,400,"290 RUE MONTIGNY","SAINT-JEROME","J7Z 5T3","SJ Réfection d'équipement CVCA (140 000 $)"]
[100171,7806404,1060,400,"290 RUE MONTIGNY","SAINT-JEROME","J7Z 5T3","SJ Réfection de la maçonnerie et béton 2009-10 (350 000 $ ART)"]
[100171,7806403,1060,400,"290 RUE MONTIGNY","SAINT-JEROME","J7Z 5T3","SJ Aménagement de la pédiatrie 270 000$"]
[100171,7806402,1060,400,"290 RUE MONTIGNY","SAINT-JEROME","J7Z 5T3","SJ Chambres bariatriques LG Rolland (rénov. fonct. 35 000 $)"]
[100171,7806401,1060,400,"290 RUE MONTIGNY","SAINT-JEROME","J7Z 5T3","SJ Remplacement fenêtres 2007-08 (550 000$)"]
[100171,7806200,1085,300,"234 RUE SAINT-VINCENT","SAINTE-AGATHE-DES-MONTS","J8C 2B8","DS Maintien d'actifs immobiliers"]
[100171,7805803,1132,901,"419 DE LA MADONE","MONT-LAURIER","J9L 1S1","CJ Entr. & rép.instal.-Mt-Laurier"]
[100171,7805802,1131,901,"143 AVENUE DE LA PROVIDENCE","LACHUTE","J8H 4E9","CJ Entr. & rép. install.-Lachute"]
[100171,7805801,1036,901,"500 BOULEVARD DES LAURENTIDES SUITE 241","SAINT-JÉRÔME","J7Z 4M2","CJ Entr. & rép. install.-Salaires"]
[100171,7805101,1044,100,"757 DE LA MADONE","MONT-LAURIER","J9L 1T3","AL CL-Entretien et rép. espaces loués"]
[100171,7802701,1051,800,"145 AVENUE DE LA PROVIDENCE","LACHUTE","J8H 4C7","AR GBM Exploitation EM"]
[100171,7802700,1051,800,"145 AVENUE DE LA PROVIDENCE","LACHUTE","J8H 4C7","AR INACTIF RE 7802701 Entretien réparations"]
[100171,7802666,1088,600,"9100 RUE DUMOUCHEL","MIRABEL","J7N 5A1","DM INACTIF RE 7802601 Ent Rép EM CHSB"]
[100171,7802651,1070,700,"100, RUE DU CHANOINE-LIONEL-GROULX","SAINTE-THERESE","J7E 5E1","DM INACTIF RE 7802601 Ent Rép EM CLSC"]
[100171,7802641,1070,700,"100, RUE DU CHANOINE-LIONEL-GROULX","SAINTE-THERESE","J7E 5E1","DM INACTIF RE 7802601 Ent Rép EM CHSE"]
[100171,7802636,1093,600,"520 BOUL. ARTHUR-SAUVE","SAINT-EUSTACHE","J7R 5B1","DM INACTIF Ent. Rép. Équip. Méd PSY RE 7802601"]
[100171,7802601,1093,600,"520 BOUL. ARTHUR-SAUVE","SAINT-EUSTACHE","J7R 5B1","DM  GBM Exploitation EM"]
[100171,7802410,1060,400,"290 RUE MONTIGNY","SAINT-JEROME","J7Z 5T3","DS GBM Exploitation Dialyse"]
[100171,7802344,1060,400,"290 RUE MONTIGNY","SAINT-JEROME","J7Z 5T3","SJ INACTIF RE 7802401 GBM exploit EM PDH"]
[100171,7802544,1060,400,"290 RUE MONTIGNY","SAINT-JEROME","J7Z 5T3","SJ INACTIF RE 7802401 GBM exploit EM TDB"]
[100171,7802744,1060,400,"290 RUE MONTIGNY","SAINT-JEROME","J7Z 5T3","SJ INACTIF RE 7802401 GBM exploit EM ARG"]
[100171,7802401,1060,400,"290 RUE MONTIGNY","SAINT-JEROME","J7Z 5T3","SJ GBM Exploitation EM"]
[100171,6607261,1085,300,"234 RUE SAINT-VINCENT","SAINTE-AGATHE-DES-MONTS","J8C 2B8","DS GBM Laboratoires regroupés"]
[100171,6831281,1085,300,"234 RUE SAINT-VINCENT","SAINTE-AGATHE-DES-MONTS","J8C 2B8","DS GBM Radiologie générale"]
[100171,7802201,1085,300,"234 RUE SAINT-VINCENT","SAINTE-AGATHE-DES-MONTS","J8C 2B8","DS GBM Exploitation EM"]
[100171,7802103,8000,100,"2561 CHEMIN DE LA LIEVRE SUD","MONT-LAURIER","J9L 3G3","AL INACTIF RE 7802101 SA-Ent.rép.inst-équip.médicaux"]
[100171,7802102,8000,100,"2561 CHEMIN DE LA LIEVRE SUD","MONT-LAURIER","J9L 3G3","AL INACTIF RE 7802101 ML Ent rép inst EM"]
[100171,7802101,8000,100,"2561 CHEMIN DE LA LIEVRE SUD","MONT-LAURIER","J9L 3G3","AL GBM Exploitation EM"]
[100171,7801806,1047,200,"1525 RUE L'ANNONCIATION NORD","RIVIERE-ROUGE","J0T 1T0","CJ Entr. & rép.install.-Huberdeau"]
[100171,7801805,1031,901,"148 RUE CASTONGUAY","SAINT-JÉRÔME"," J7Y2J2","CJ Entr.&rép.install.-C.St-Jérôme"]
[100171,7801804,1034,901,"358 RUE LAVIOLETTE","SAINT-JÉRÔME","J7Y 2T1","CJ E.&rép.install.-348-352 Bocage"]
[100171,7801801,1028,901,"125A CHEMIN DU TOUR-DU-LAC","SAINTE-AGATHE-DES-MONTS","J8C 1B4","CJ Entr.&rép. install.-Ste-Agathe"]
[100171,7801701,1051,800,"145 AVENUE DE LA PROVIDENCE","LACHUTE","J8H 4C7","AR Entretien du parc immobilier"]
[100171,7801700,1051,800,"145 AVENUE DE LA PROVIDENCE","LACHUTE","J8H 4C7","AR INACTIF RE 7801602 Entretien- réparations"]
{"$rows_left_out":2222}
{"sheet":"Fiche","index":1,"n_rows":37,"n_cols":6,"rows_kept":37,"cut":false,"hidden":false,"merged":[[36,1,36,5],[9,0,9,1],[13,3,13,4],[11,0,13,0],[11,3,11,4],[12,3,12,4],[14,3,14,4],[18,3,18,4],[19,3,19,4],[20,3,20,4],[21,3,21,4],[14,0,33,0],[33,3,33,4],[25,3,25,4],[30,3,30,4],[31,3,31,4],[2,2,6,3],[22,3,22,4],[23,3,23,4],[24,3,24,4],[8,4,8,5],[10,0,10,5]]}
[]
[]
[null,null,"Transmettre votre fiche de besoin par courriel au: appro64.cissslau@ssss.gouv.qc.ca\nVeuillez allouer un délai de 72h ouvrable après l'envoi du courriel pour la réception de votre commande."]
[]
[]
[]
[]
[null,"Fiche de besoin pour RI-RPA\nCHSLD privé"]
[]
[{"$f":" \"Date de la demande: \"","v":"Date de la demande: "},null,{"$f":"TODAY()","v":"2021-04-08"}]
["Cochez cette case si vous avez fait au préalable vos démarches auprès de vos fournisseurs habituels"]
["Informations","Unité administrative","Nom de l'établissement demandeur:","Adresse:",null,"Nom du demandeur:"]
[]
[null,"Produits","Code GRM","Quantité",null,"Format"]
["Description:","Masque de procédure Niveau 2 ou 3",42051966,null,null,"Boîtes de 50"]
[null,"Masque de procédure Niveau 1",42009429,null,null,"Boîtes de 50"]
[null,"Masque N95 Médicom Small",42052187,null,null,"Boîtes de 50"]
[null,"Masque N95 Médicom Medium",42052188,null,null,"Boîtes de 50"]
[null,"Lunette lavable",46000164,null,null,"unités"]
[null,"Visière courte (visière et monture) lavable","42022223\n42022224",null,null,"unités"]
[null,"Visière longue lavable",42050068,null,null,"unités"]
[null,"Gants S",42006507,null,null,"Boîtes de 100"]
[null,"Gants M",42006506,null,null,"Boîtes de 100"]
[null,"Gants L",42006505,null,null,"Boîtes de 100"]
[null,"Gants XL",42006508,null,null,"Boîtes de 100"]
[null,"Jaquette jetable Small",42052024,null,null,"unités"]
[null,"Jaquette jetable(universel-med-large)",42036458,null,null,"unités"]
[null,"Jaquette jetable XL",42002202,null,null,"unités"]
[null,"Jaquette jetable XXL",42052067,null,null,"unités"]
[null,"Jaquette jetable XXXL",42052068,null,null,"unités"]
[null,"Stérigel bouteille de 500 ml à 1L pour les mains",47002663,null,null,"unités"]
[null,"Désinfectant liquide opticide pour surface ",53000527,null,null,"3.78L"]
[null,"Lingettes désinfectante 3 à 5 min",47000219,null,null,"contenant"]
[null,"Visière longue réutilisable (visière et harnais) (retirer les pellicules plastiques avant usage)","31007267\n46000387",null,null,"unités"]
[]
[]
[null,"*Pour tout besoin autre, communiquez avec votre ressource au CISSS des Laurentides.*"]

{"sheet":"Indicateur","index":2,"n_rows":13,"n_cols":7,"rows_kept":13,"cut":false,"hidden":true,"merged":[]}
["Produit","Code d'article","Code GRM","Concatener","Stock 64","Consommation moyenne","Nombre de jours avant 0 stock"]
["Masque de procédure",{"$f":"INDEX('[3]FEUILLE DE TRAVAIL'!$A:$AT,MATCH(C2,'[3]FEUILLE DE TRAVAIL'!$K:$K,0),8)","v":{"$error":"#N/A"}},42050116,4205011654,{"$f":"INDEX('[3]FEUILLE DE TRAVAIL'!$A:$AT,MATCH(D2,'[3]FEUILLE DE TRAVAIL'!$L:$L,0),22)","v":{"$error":"#N/A"}},{"$f":"INDEX('[3]FEUILLE DE TRAVAIL'!$A:$AT,MATCH(D2,'[3]FEUILLE DE TRAVAIL'!$L:$L,0),44)","v":{"$error":"#N/A"}},{"$f":"E2/F2","v":{"$error":"#N/A"}}]
["Lunette lavable",{"$f":"INDEX('[3]FEUILLE DE TRAVAIL'!$A:$AT,MATCH(C3,'[3]FEUILLE DE TRAVAIL'!$K:$K,0),8)","v":{"$error":"#N/A"}},46000164,4600016454,{"$f":"INDEX('[3]FEUILLE DE TRAVAIL'!$A:$AT,MATCH(D3,'[3]FEUILLE DE TRAVAIL'!$L:$L,0),22)","v":{"$error":"#N/A"}},{"$f":"INDEX('[3]FEUILLE DE TRAVAIL'!$A:$AT,MATCH(D3,'[3]FEUILLE DE TRAVAIL'!$L:$L,0),44)","v":{"$error":"#N/A"}},{"$f":"E3/F3","v":{"$error":"#N/A"}}]
["Visière courte lavable",{"$f":"INDEX('[3]FEUILLE DE TRAVAIL'!$A:$AT,MATCH(C4,'[3]FEUILLE DE TRAVAIL'!$K:$K,0),8)","v":{"$error":"#N/A"}},42022223,4202222354,{"$f":"INDEX('[3]FEUILLE DE TRAVAIL'!$A:$AT,MATCH(D4,'[3]FEUILLE DE TRAVAIL'!$L:$L,0),22)","v":{"$error":"#N/A"}},{"$f":"INDEX('[3]FEUILLE DE TRAVAIL'!$A:$AT,MATCH(D4,'[3]FEUILLE DE TRAVAIL'!$L:$L,0),44)","v":{"$error":"#N/A"}},{"$error":"#N/A"}]
["Monture pour visière",{"$f":"INDEX('[3]FEUILLE DE TRAVAIL'!$A:$AT,MATCH(C5,'[3]FEUILLE DE TRAVAIL'!$K:$K,0),8)","v":{"$error":"#N/A"}},42022224,4202222454,{"$f":"INDEX('[3]FEUILLE DE TRAVAIL'!$A:$AT,MATCH(D5,'[3]FEUILLE DE TRAVAIL'!$L:$L,0),22)","v":{"$error":"#N/A"}},{"$f":"INDEX('[3]FEUILLE DE TRAVAIL'!$A:$AT,MATCH(D5,'[3]FEUILLE DE TRAVAIL'!$L:$L,0),44)","v":{"$error":"#N/A"}},{"$error":"#N/A"}]
["Visière longue lavable",{"$f":"INDEX('[3]FEUILLE DE TRAVAIL'!$A:$AT,MATCH(C6,'[3]FEUILLE DE TRAVAIL'!$K:$K,0),8)","v":{"$error":"#N/A"}},42050068,4205006854,{"$f":"INDEX('[3]FEUILLE DE TRAVAIL'!$A:$AT,MATCH(D6,'[3]FEUILLE DE TRAVAIL'!$L:$L,0),22)","v":{"$error":"#N/A"}},{"$f":"INDEX('[3]FEUILLE DE TRAVAIL'!$A:$AT,MATCH(D6,'[3]FEUILLE DE TRAVAIL'!$L:$L,0),44)","v":{"$error":"#N/A"}},{"$error":"#N/A"}]
["Gants S",{"$f":"INDEX('[3]FEUILLE DE TRAVAIL'!$A:$AT,MATCH(C7,'[3]FEUILLE DE TRAVAIL'!$K:$K,0),8)","v":{"$error":"#N/A"}},42006507,4200650754,{"$f":"INDEX('[3]FEUILLE DE TRAVAIL'!$A:$AT,MATCH(D7,'[3]FEUILLE DE TRAVAIL'!$L:$L,0),22)","v":{"$error":"#N/A"}},{"$f":"INDEX('[3]FEUILLE DE TRAVAIL'!$A:$AT,MATCH(D7,'[3]FEUILLE DE TRAVAIL'!$L:$L,0),44)","v":{"$error":"#N/A"}},{"$error":"#N/A"}]
["Gants M",{"$f":"INDEX('[3]FEUILLE DE TRAVAIL'!$A:$AT,MATCH(C8,'[3]FEUILLE DE TRAVAIL'!$K:$K,0),8)","v":{"$error":"#N/A"}},42006506,4200650654,{"$f":"INDEX('[3]FEUILLE DE TRAVAIL'!$A:$AT,MATCH(D8,'[3]FEUILLE DE TRAVAIL'!$L:$L,0),22)","v":{"$error":"#N/A"}},{"$f":"INDEX('[3]FEUILLE DE TRAVAIL'!$A:$AT,MATCH(D8,'[3]FEUILLE DE TRAVAIL'!$L:$L,0),44)","v":{"$error":"#N/A"}},{"$error":"#N/A"}]
["Gants L",{"$f":"INDEX('[3]FEUILLE DE TRAVAIL'!$A:$AT,MATCH(C9,'[3]FEUILLE DE TRAVAIL'!$K:$K,0),8)","v":{"$error":"#N/A"}},42006505,4200650554,{"$f":"INDEX('[3]FEUILLE DE TRAVAIL'!$A:$AT,MATCH(D9,'[3]FEUILLE DE TRAVAIL'!$L:$L,0),22)","v":{"$error":"#N/A"}},{"$f":"INDEX('[3]FEUILLE DE TRAVAIL'!$A:$AT,MATCH(D9,'[3]FEUILLE DE TRAVAIL'!$L:$L,0),44)","v":{"$error":"#N/A"}},{"$error":"#N/A"}]
["Gants XL",{"$f":"INDEX('[3]FEUILLE DE TRAVAIL'!$A:$AT,MATCH(C10,'[3]FEUILLE DE TRAVAIL'!$K:$K,0),8)","v":{"$error":"#N/A"}},42006508,4200650854,{"$f":"INDEX('[3]FEUILLE DE TRAVAIL'!$A:$AT,MATCH(D10,'[3]FEUILLE DE TRAVAIL'!$L:$L,0),22)","v":{"$error":"#N/A"}},{"$f":"INDEX('[3]FEUILLE DE TRAVAIL'!$A:$AT,MATCH(D10,'[3]FEUILLE DE TRAVAIL'!$L:$L,0),44)","v":{"$error":"#N/A"}},{"$error":"#N/A"}]
["Jaquette jetable",{"$f":"INDEX('[3]FEUILLE DE TRAVAIL'!$A:$AT,MATCH(C11,'[3]FEUILLE DE TRAVAIL'!$K:$K,0),8)","v":{"$error":"#N/A"}},42036458,4203645854,{"$f":"INDEX('[3]FEUILLE DE TRAVAIL'!$A:$AT,MATCH(D11,'[3]FEUILLE DE TRAVAIL'!$L:$L,0),22)","v":{"$error":"#N/A"}},{"$f":"INDEX('[3]FEUILLE DE TRAVAIL'!$A:$AT,MATCH(D11,'[3]FEUILLE DE TRAVAIL'!$L:$L,0),44)","v":{"$error":"#N/A"}},{"$error":"#N/A"}]
["Stérigel bouteille de 500 ml à 1L pour les mains",{"$f":"INDEX('[3]FEUILLE DE TRAVAIL'!$A:$AT,MATCH(C12,'[3]FEUILLE DE TRAVAIL'!$K:$K,0),8)","v":{"$error":"#N/A"}},47002663,4700266354,{"$f":"INDEX('[3]FEUILLE DE TRAVAIL'!$A:$AT,MATCH(D12,'[3]FEUILLE DE TRAVAIL'!$L:$L,0),22)","v":{"$error":"#N/A"}},{"$f":"INDEX('[3]FEUILLE DE TRAVAIL'!$A:$AT,MATCH(D12,'[3]FEUILLE DE TRAVAIL'!$L:$L,0),44)","v":{"$error":"#N/A"}},{"$error":"#N/A"}]
["Désinfectant liquide opticide pour surface ",{"$f":"INDEX('[3]FEUILLE DE TRAVAIL'!$A:$AT,MATCH(C13,'[3]FEUILLE DE TRAVAIL'!$K:$K,0),8)","v":{"$error":"#N/A"}},53000527,5300052754,{"$f":"INDEX('[3]FEUILLE DE TRAVAIL'!$A:$AT,MATCH(D13,'[3]FEUILLE DE TRAVAIL'!$L:$L,0),22)","v":{"$error":"#N/A"}},{"$f":"INDEX('[3]FEUILLE DE TRAVAIL'!$A:$AT,MATCH(D13,'[3]FEUILLE DE TRAVAIL'!$L:$L,0),44)","v":{"$error":"#N/A"}},{"$error":"#N/A"}]